{"text_format":"1","workbook":"xlsx","n_sheets":2,"sheets":["PLAN OP","Datos"],"not_rendered":{"charts":0,"images":1,"macros":1,"external_links":3,"defined_names":41,"comments":0,"pivot_tables":0},"unopened":[],"bounds":{"document_bytes":16777216,"sheet_cells":100000,"rows_first":2000,"rows_last":500,"rows_between":2000,"halvings":0,"cell_chars":16384,"cell_head_chars":4096},"cells_cut":0,"cells_raw":0,"read":"whole","date_system":"1900"}

{"sheet":"PLAN OP","index":0,"n_rows":1000,"n_cols":21,"rows_kept":1000,"cut":false,"hidden":false,"merged":[[0,0,0,20]]}
["PLANTILLA PLAN OPERATIVO DE RECOLECCION"]
["NOMBRE DEPARTAMENTO","CODIGO DEPARTAMENTO","TURNO",null,"NOMBRE MUNICIPIO","CODIGO MUNICIPIO","TIPO DE SERVICIO","MACRO","FRECUENCIA",null,"CONSECUTIVO MICRORUTA","MICRO RUTA NUEVA","MICRO RUTA ANTIGUA","SECTORES ATENDIDOS","No. CONDUCTORES","No. AYUDANTES","No. CALLEJONEROS","TIPO DE VEHICULO","TON / SEMANAL RUTA","KMS RUTA","OBSERVACION"]
["GUAJIRA",{"$f":"OFFSET(Datos!$B$1,MATCH(A3,Datos!$A$2:$A$34,0),0)","v":"44"},"1 DIA",{"$f":"MID(C3,1,1)","v":"1"},"MAICAO",{"$f":"OFFSET(Datos!$G$1,MATCH(E3,Datos!$H$2:$H$1121,0),0)","v":"430"},"01 Recoleccion Domiciliaria",{"$f":"MID(G3,1,2)","v":"01"},"01 LU-MI-VI",{"$f":"MID(I3,1,2)","v":"01"},"001",{"$f":"CONCATENATE(B3,D3,F3,H3,J3,K3)","v":"4414300101001"},"100M","Jorge Arrieta - Camilo Torres Erika Beatriz - Mingo Cando - Villa Melia 2 - Nueva Esperanza",1,2,0,"COMPACTADOR 25Y"]
["GUAJIRA",{"$f":"OFFSET(Datos!$B$1,MATCH(A4,Datos!$A$2:$A$34,0),0)","v":"44"},"1 DIA","1","MAICAO",{"$f":"OFFSET(Datos!$G$1,MATCH(E4,Datos!$H$2:$H$1121,0),0)","v":"430"},"01 Recoleccion Domiciliaria","01","01 LU-MI-VI","01","002","4414300101002","101M","Villa Daisy - Villa Ines - Urb. Villa Ines - Villa Uriana - La Esmeralda - 11 de Noviembre - 20 de Julio",1,2,0,"COMPACTADOR 25Y"]
["GUAJIRA",{"$f":"OFFSET(Datos!$B$1,MATCH(A5,Datos!$A$2:$A$34,0),0)","v":"44"},"1 DIA","1","MAICAO",{"$f":"OFFSET(Datos!$G$1,MATCH(E5,Datos!$H$2:$H$1121,0),0)","v":"430"},"01 Recoleccion Domiciliaria","01","01 LU-MI-VI","01","003","4414300101003","102M","Villa Melia - Marina Esperanza - Galan - Santa Isabel - San Antonio - Santa Fe - Alfonso Lopez ",1,2,0,"COMPACTADOR 25Y"]
["GUAJIRA",{"$f":"OFFSET(Datos!$B$1,MATCH(A6,Datos!$A$2:$A$34,0),0)","v":"44"},"3 NOCHE","3","MAICAO",{"$f":"OFFSET(Datos!$G$1,MATCH(E6,Datos!$H$2:$H$1121,0),0)","v":"430"},"01 Recoleccion Domiciliaria","01","01 LU-MI-VI","01","004","4434300101004","150M","Torre la Majayura - Ovidio Mejia - Miguel Lora - Rojas Pinilla - San Jose - San Martin",1,2,0,"COMPACTADOR 25Y"]
["GUAJIRA",{"$f":"OFFSET(Datos!$B$1,MATCH(A7,Datos!$A$2:$A$34,0),0)","v":"44"},"3 NOCHE","3","MAICAO",{"$f":"OFFSET(Datos!$G$1,MATCH(E7,Datos!$H$2:$H$1121,0),0)","v":"430"},"01 Recoleccion Domiciliaria","01","01 LU-MI-VI","01","005","4434300101005","151M","La Victoria - Colombia Libre - Los Comuneros - Santo Domingo - Camilo Torres - 1 de Mayo - Fonseca Siosi - El Bosque",1,2,0,"COMPACTADOR 20Y"]
["GUAJIRA",{"$f":"OFFSET(Datos!$B$1,MATCH(A8,Datos!$A$2:$A$34,0),0)","v":"44"},"3 NOCHE","3","MAICAO",{"$f":"OFFSET(Datos!$G$1,MATCH(E8,Datos!$H$2:$H$1121,0),0)","v":"430"},"01 Recoleccion Domiciliaria","01","01 LU-MI-VI","01","006","4434300101006","152M","Boscan - Altos de Boscan - El Bosque - Maximiliano - Majupai - Concepcion - Flor de Cañaguate",1,2,0,"COMPACTADOR 25Y"]
["GUAJIRA",{"$f":"OFFSET(Datos!$B$1,MATCH(A9,Datos!$A$2:$A$34,0),0)","v":"44"},"1 DIA","1","MAICAO",{"$f":"OFFSET(Datos!$G$1,MATCH(E9,Datos!$H$2:$H$1121,0),0)","v":"430"},"01 Recoleccion Domiciliaria","01","02 MA-JU-SA","02","007","4414300102007","200M","Divino niño - 1 de Diciembre - Mareygua - Buenos Aires Viejo - Mareyguita - Miraflores - San Francisco - Monte Bello - Las Americas",0,0,0,"COMPACTADOR 25Y"]
["GUAJIRA",{"$f":"OFFSET(Datos!$B$1,MATCH(A10,Datos!$A$2:$A$34,0),0)","v":"44"},"1 DIA","1","MAICAO",{"$f":"OFFSET(Datos!$G$1,MATCH(E10,Datos!$H$2:$H$1121,0),0)","v":"430"},"01 Recoleccion Domiciliaria","01","02 MA-JU-SA","02","008","4414300102008","201M","Concepcion - Vincula Palacio - Nazareth - Almirante Padilla - Almirante Padilla 2 - Tony Vergara - Loma Fresca ",0,0,0,"COMPACTADOR 25Y"]
["GUAJIRA",{"$f":"OFFSET(Datos!$B$1,MATCH(A11,Datos!$A$2:$A$34,0),0)","v":"44"},"1 DIA","1","MAICAO",{"$f":"OFFSET(Datos!$G$1,MATCH(E11,Datos!$H$2:$H$1121,0),0)","v":"430"},"01 Recoleccion Domiciliaria","01","02 MA-JU-SA","02","009","4414300102009","202M","Santander - Boscan - Maicaito - Paraiso - 28 de Noviembre - El Carmen",0,0,0,"COMPACTADOR 25Y"]
["GUAJIRA",{"$f":"OFFSET(Datos!$B$1,MATCH(A12,Datos!$A$2:$A$34,0),0)","v":"44"},"3 NOCHE","3","MAICAO",{"$f":"OFFSET(Datos!$G$1,MATCH(E12,Datos!$H$2:$H$1121,0),0)","v":"430"},"01 Recoleccion Domiciliaria","01","02 MA-JU-SA","02","010","4434300102010","250M","Pastrana - San Martin",0,0,0,"COMPACTADOR 25Y"]
["GUAJIRA",{"$f":"OFFSET(Datos!$B$1,MATCH(A13,Datos!$A$2:$A$34,0),0)","v":"44"},"3 NOCHE","3","MAICAO",{"$f":"OFFSET(Datos!$G$1,MATCH(E13,Datos!$H$2:$H$1121,0),0)","v":"430"},"01 Recoleccion Domiciliaria","01","02 MA-JU-SA","02","011","4434300102011","251M","El Carmen - Altos Parrantial",0,0,0,"COMPACTADOR 20Y"]
["GUAJIRA",{"$f":"OFFSET(Datos!$B$1,MATCH(A14,Datos!$A$2:$A$34,0),0)","v":"44"},"3 NOCHE","3","MAICAO",{"$f":"OFFSET(Datos!$G$1,MATCH(E14,Datos!$H$2:$H$1121,0),0)","v":"430"},"01 Recoleccion Domiciliaria","01","02 MA-JU-SA","02","012","4434300102012","252M","Villa Mery - Villa Naty - Villa Uci - Alto Prado - Simon Mejia - Los Laureles - 7 de Agosto - Urb. Buenos Aires",0,0,0,"COMPACTADOR 25Y"]
["GUAJIRA",{"$f":"OFFSET(Datos!$B$1,MATCH(A15,Datos!$A$2:$A$34,0),0)","v":"44"},"3 NOCHE","3","MAICAO",{"$f":"OFFSET(Datos!$G$1,MATCH(E15,Datos!$H$2:$H$1121,0),0)","v":"430"},"06 Recoleccion Comercial","06","06 LU-MA-MI-JU-VI-SA","06","013","4434300606013","350M","Centro",0,0,0,"COMPACTADOR 25Y"]
["GUAJIRA",{"$f":"OFFSET(Datos!$B$1,MATCH(A16,Datos!$A$2:$A$34,0),0)","v":"44"},"1 DIA","1","MAICAO",{"$f":"OFFSET(Datos!$G$1,MATCH(E16,Datos!$H$2:$H$1121,0),0)","v":"430"},"08 Recoleccion Rural","08","03 LU-JU","03","014","4414300803014","110M","Cuatro Vias",1,2,0,"COMPACTADOR 20Y"]
["GUAJIRA",{"$f":"OFFSET(Datos!$B$1,MATCH(A17,Datos!$A$2:$A$34,0),0)","v":"44"},"1 DIA","1","MAICAO",{"$f":"OFFSET(Datos!$G$1,MATCH(E17,Datos!$H$2:$H$1121,0),0)","v":"430"},"08 Recoleccion Rural","08","04 MA-VI","04","015","4414300804015","120M","Paraguachon",0,0,0,"COMPACTADOR 20Y"]
["GUAJIRA",{"$f":"OFFSET(Datos!$B$1,MATCH(A18,Datos!$A$2:$A$34,0),0)","v":"44"},"1 DIA","1","MAICAO",{"$f":"OFFSET(Datos!$G$1,MATCH(E18,Datos!$H$2:$H$1121,0),0)","v":"430"},"08 Recoleccion Rural","08","05 MI-SA","05","016","4414300805016","210M","Carraipia",0,0,0,"COMPACTADOR 20Y"]
["GUAJIRA",{"$f":"OFFSET(Datos!$B$1,MATCH(A19,Datos!$A$2:$A$34,0),0)","v":"44"},"1 DIA","1","MAICAO",{"$f":"OFFSET(Datos!$G$1,MATCH(E19,Datos!$H$2:$H$1121,0),0)","v":"430"},"07 Recoleccion Vias principales","07","08 DO","08","017","4414300708017","171M","Recoleccion Avenidas"]
["GUAJIRA",{"$f":"OFFSET(Datos!$B$1,MATCH(A20,Datos!$A$2:$A$34,0),0)","v":"44"},"3 NOCHE","3","MAICAO",{"$f":"OFFSET(Datos!$G$1,MATCH(E20,Datos!$H$2:$H$1121,0),0)","v":"430"},"07 Recoleccion Vias principales","07","08 DO","08","018","4434300708018","172M","Recoleccion Avenidas"]
["GUAJIRA",{"$f":"OFFSET(Datos!$B$1,MATCH(A21,Datos!$A$2:$A$34,0),0)","v":"44"},"1 DIA","1","MAICAO",{"$f":"OFFSET(Datos!$G$1,MATCH(E21,Datos!$H$2:$H$1121,0),0)","v":"430"},"02 Recoleccion Grandes Generadores","02","06 LU-MA-MI-JU-VI-SA","06","019","4414300206019","500M","Grandes Generadores"]
["GUAJIRA",{"$f":"OFFSET(Datos!$B$1,MATCH(A22,Datos!$A$2:$A$34,0),0)","v":"44"},"2 TARDE","2","MAICAO",{"$f":"OFFSET(Datos!$G$1,MATCH(E22,Datos!$H$2:$H$1121,0),0)","v":"430"},"03 Recoleccion Barrido Manual y Empuje","03","06 LU-MA-MI-JU-VI-SA","06","020","4424300306020","600M","Recoleccion Barrido Manual y Empuje"]
["GUAJIRA",{"$f":"OFFSET(Datos!$B$1,MATCH(A23,Datos!$A$2:$A$34,0),0)","v":"44"},"1 DIA","1","MAICAO",{"$f":"OFFSET(Datos!$G$1,MATCH(E23,Datos!$H$2:$H$1121,0),0)","v":"430"},"17  Lavado Areas Publicas","17","15 Mesual","15","021","4414301715021","610M","Lavado"]
["GUAJIRA",{"$f":"OFFSET(Datos!$B$1,MATCH(A24,Datos!$A$2:$A$34,0),0)","v":"44"},"1 DIA","1","MAICAO",{"$f":"OFFSET(Datos!$G$1,MATCH(E24,Datos!$H$2:$H$1121,0),0)","v":"430"},"23 Limpieza de vias y areas publicas","23","15 Mesual","15","022","4414302315022","710M","Puntos Criticos"]
["GUAJIRA",{"$f":"OFFSET(Datos!$B$1,MATCH(A25,Datos!$A$2:$A$34,0),0)","v":"44"},"1 DIA","1","MAICAO",{"$f":"OFFSET(Datos!$G$1,MATCH(E25,Datos!$H$2:$H$1121,0),0)","v":"430"},"10 Recoleccion Aprovechamiento","10","01 LU-MI-VI","01","023","4414301001023","801M","Punots Limpios"]
["GUAJIRA",{"$f":"OFFSET(Datos!$B$1,MATCH(A26,Datos!$A$2:$A$34,0),0)","v":"44"},"1 DIA","1","MAICAO",{"$f":"OFFSET(Datos!$G$1,MATCH(E26,Datos!$H$2:$H$1121,0),0)","v":"430"},"26 Eventos Regionales","26","15 Mesual","15","024","4414302615024","810M","Eventos Especiales"]
[null,{"$f":"OFFSET(Datos!$B$1,MATCH(A27,Datos!$A$2:$A$34,0),0)","v":{"$error":"#N/A"}},null,"",null,{"$f":"OFFSET(Datos!$G$1,MATCH(E27,Datos!$H$2:$H$1121,0),0)","v":{"$error":"#N/A"}},null,"",null,"",null,{"$error":"#N/A"}]
[null,{"$f":"OFFSET(Datos!$B$1,MATCH(A28,Datos!$A$2:$A$34,0),0)","v":{"$error":"#N/A"}},null,"",null,{"$f":"OFFSET(Datos!$G$1,MATCH(E28,Datos!$H$2:$H$1121,0),0)","v":{"$error":"#N/A"}},null,"",null,"",null,{"$error":"#N/A"}]
[null,{"$f":"OFFSET(Datos!$B$1,MATCH(A29,Datos!$A$2:$A$34,0),0)","v":{"$error":"#N/A"}},null,"",null,{"$f":"OFFSET(Datos!$G$1,MATCH(E29,Datos!$H$2:$H$1121,0),0)","v":{"$error":"#N/A"}},null,"",null,"",null,{"$error":"#N/A"}]
[null,{"$f":"OFFSET(Datos!$B$1,MATCH(A30,Datos!$A$2:$A$34,0),0)","v":{"$error":"#N/A"}},null,"",null,{"$f":"OFFSET(Datos!$G$1,MATCH(E30,Datos!$H$2:$H$1121,0),0)","v":{"$error":"#N/A"}},null,"",null,"",null,{"$error":"#N/A"}]
[null,{"$f":"OFFSET(Datos!$B$1,MATCH(A31,Datos!$A$2:$A$34,0),0)","v":{"$error":"#N/A"}},null,"",null,{"$f":"OFFSET(Datos!$G$1,MATCH(E31,Datos!$H$2:$H$1121,0),0)","v":{"$error":"#N/A"}},null,"",null,"",null,{"$error":"#N/A"}]
[null,{"$f":"OFFSET(Datos!$B$1,MATCH(A32,Datos!$A$2:$A$34,0),0)","v":{"$error":"#N/A"}},null,"",null,{"$f":"OFFSET(Datos!$G$1,MATCH(E32,Datos!$H$2:$H$1121,0),0)","v":{"$error":"#N/A"}},null,"",null,"",null,{"$error":"#N/A"}]
[null,{"$f":"OFFSET(Datos!$B$1,MATCH(A33,Datos!$A$2:$A$34,0),0)","v":{"$error":"#N/A"}},null,"",null,{"$f":"OFFSET(Datos!$G$1,MATCH(E33,Datos!$H$2:$H$1121,0),0)","v":{"$error":"#N/A"}},null,"",null,"",null,{"$error":"#N/A"}]
[null,{"$f":"OFFSET(Datos!$B$1,MATCH(A34,Datos!$A$2:$A$34,0),0)","v":{"$error":"#N/A"}},null,"",null,{"$f":"OFFSET(Datos!$G$1,MATCH(E34,Datos!$H$2:$H$1121,0),0)","v":{"$error":"#N/A"}},null,"",null,"",null,{"$error":"#N/A"}]
[null,{"$f":"OFFSET(Datos!$B$1,MATCH(A35,Datos!$A$2:$A$34,0),0)","v":{"$error":"#N/A"}},null,"",null,{"$f":"OFFSET(Datos!$G$1,MATCH(E35,Datos!$H$2:$H$1121,0),0)","v":{"$error":"#N/A"}},null,"",null,"",null,{"$error":"#N/A"}]
[null,{"$f":"OFFSET(Datos!$B$1,MATCH(A36,Datos!$A$2:$A$34,0),0)","v":{"$error":"#N/A"}},null,"",null,{"$f":"OFFSET(Datos!$G$1,MATCH(E36,Datos!$H$2:$H$1121,0),0)","v":{"$error":"#N/A"}},null,"",null,"",null,{"$error":"#N/A"}]
[null,{"$f":"OFFSET(Datos!$B$1,MATCH(A37,Datos!$A$2:$A$34,0),0)","v":{"$error":"#N/A"}},null,"",null,{"$f":"OFFSET(Datos!$G$1,MATCH(E37,Datos!$H$2:$H$1121,0),0)","v":{"$error":"#N/A"}},null,"",null,"",null,{"$error":"#N/A"}]
[null,{"$f":"OFFSET(Datos!$B$1,MATCH(A38,Datos!$A$2:$A$34,0),0)","v":{"$error":"#N/A"}},null,"",null,{"$f":"OFFSET(Datos!$G$1,MATCH(E38,Datos!$H$2:$H$1121,0),0)","v":{"$error":"#N/A"}},null,"",null,"",null,{"$error":"#N/A"}]
[null,{"$f":"OFFSET(Datos!$B$1,MATCH(A39,Datos!$A$2:$A$34,0),0)","v":{"$error":"#N/A"}},null,"",null,{"$f":"OFFSET(Datos!$G$1,MATCH(E39,Datos!$H$2:$H$1121,0),0)","v":{"$error":"#N/A"}},null,"",null,"",null,{"$error":"#N/A"}]
[null,{"$f":"OFFSET(Datos!$B$1,MATCH(A40,Datos!$A$2:$A$34,0),0)","v":{"$error":"#N/A"}},null,"",null,{"$f":"OFFSET(Datos!$G$1,MATCH(E40,Datos!$H$2:$H$1121,0),0)","v":{"$error":"#N/A"}},null,"",null,"",null,{"$error":"#N/A"}]
[null,{"$f":"OFFSET(Datos!$B$1,MATCH(A41,Datos!$A$2:$A$34,0),0)","v":{"$error":"#N/A"}},null,"",null,{"$f":"OFFSET(Datos!$G$1,MATCH(E41,Datos!$H$2:$H$1121,0),0)","v":{"$error":"#N/A"}},null,"",null,"",null,{"$error":"#N/A"}]
[null,{"$f":"OFFSET(Datos!$B$1,MATCH(A42,Datos!$A$2:$A$34,0),0)","v":{"$error":"#N/A"}},null,"",null,{"$f":"OFFSET(Datos!$G$1,MATCH(E42,Datos!$H$2:$H$1121,0),0)","v":{"$error":"#N/A"}},null,"",null,"",null,{"$error":"#N/A"}]
[null,{"$f":"OFFSET(Datos!$B$1,MATCH(A43,Datos!$A$2:$A$34,0),0)","v":{"$error":"#N/A"}},null,"",null,{"$f":"OFFSET(Datos!$G$1,MATCH(E43,Datos!$H$2:$H$1121,0),0)","v":{"$error":"#N/A"}},null,"",null,"",null,{"$error":"#N/A"}]
[null,{"$f":"OFFSET(Datos!$B$1,MATCH(A44,Datos!$A$2:$A$34,0),0)","v":{"$error":"#N/A"}},null,"",null,{"$f":"OFFSET(Datos!$G$1,MATCH(E44,Datos!$H$2:$H$1121,0),0)","v":{"$error":"#N/A"}},null,"",null,"",null,{"$error":"#N/A"}]
[null,{"$f":"OFFSET(Datos!$B$1,MATCH(A45,Datos!$A$2:$A$34,0),0)","v":{"$error":"#N/A"}},null,"",null,{"$f":"OFFSET(Datos!$G$1,MATCH(E45,Datos!$H$2:$H$1121,0),0)","v":{"$error":"#N/A"}},null,"",null,"",null,{"$error":"#N/A"}]
[null,{"$f":"OFFSET(Datos!$B$1,MATCH(A46,Datos!$A$2:$A$34,0),0)","v":{"$error":"#N/A"}},null,"",null,{"$f":"OFFSET(Datos!$G$1,MATCH(E46,Datos!$H$2:$H$1121,0),0)","v":{"$error":"#N/A"}},null,"",null,"",null,{"$error":"#N/A"}]
[null,{"$f":"OFFSET(Datos!$B$1,MATCH(A47,Datos!$A$2:$A$34,0),0)","v":{"$error":"#N/A"}},null,"",null,{"$f":"OFFSET(Datos!$G$1,MATCH(E47,Datos!$H$2:$H$1121,0),0)","v":{"$error":"#N/A"}},null,"",null,"",null,{"$error":"#N/A"}]
[null,{"$f":"OFFSET(Datos!$B$1,MATCH(A48,Datos!$A$2:$A$34,0),0)","v":{"$error":"#N/A"}},null,"",null,{"$f":"OFFSET(Datos!$G$1,MATCH(E48,Datos!$H$2:$H$1121,0),0)","v":{"$error":"#N/A"}},null,"",null,"",null,{"$error":"#N/A"}]
[null,{"$f":"OFFSET(Datos!$B$1,MATCH(A49,Datos!$A$2:$A$34,0),0)","v":{"$error":"#N/A"}},null,"",null,{"$f":"OFFSET(Datos!$G$1,MATCH(E49,Datos!$H$2:$H$1121,0),0)","v":{"$error":"#N/A"}},null,"",null,"",null,{"$error":"#N/A"}]
[null,{"$f":"OFFSET(Datos!$B$1,MATCH(A50,Datos!$A$2:$A$34,0),0)","v":{"$error":"#N/A"}},null,"",null,{"$f":"OFFSET(Datos!$G$1,MATCH(E50,Datos!$H$2:$H$1121,0),0)","v":{"$error":"#N/A"}},null,"",null,"",null,{"$error":"#N/A"}]
[null,{"$f":"OFFSET(Datos!$B$1,MATCH(A51,Datos!$A$2:$A$34,0),0)","v":{"$error":"#N/A"}},null,"",null,{"$f":"OFFSET(Datos!$G$1,MATCH(E51,Datos!$H$2:$H$1121,0),0)","v":{"$error":"#N/A"}},null,"",null,"",null,{"$error":"#N/A"}]
[null,{"$f":"OFFSET(Datos!$B$1,MATCH(A52,Datos!$A$2:$A$34,0),0)","v":{"$error":"#N/A"}},null,"",null,{"$f":"OFFSET(Datos!$G$1,MATCH(E52,Datos!$H$2:$H$1121,0),0)","v":{"$error":"#N/A"}},null,"",null,"",null,{"$error":"#N/A"}]
[null,{"$f":"OFFSET(Datos!$B$1,MATCH(A53,Datos!$A$2:$A$34,0),0)","v":{"$error":"#N/A"}},null,"",null,{"$f":"OFFSET(Datos!$G$1,MATCH(E53,Datos!$H$2:$H$1121,0),0)","v":{"$error":"#N/A"}},null,"",null,"",null,{"$error":"#N/A"}]
[null,{"$f":"OFFSET(Datos!$B$1,MATCH(A54,Datos!$A$2:$A$34,0),0)","v":{"$error":"#N/A"}},null,"",null,{"$f":"OFFSET(Datos!$G$1,MATCH(E54,Datos!$H$2:$H$1121,0),0)","v":{"$error":"#N/A"}},null,"",null,"",null,{"$error":"#N/A"}]
[null,{"$f":"OFFSET(Datos!$B$1,MATCH(A55,Datos!$A$2:$A$34,0),0)","v":{"$error":"#N/A"}},null,"",null,{"$f":"OFFSET(Datos!$G$1,MATCH(E55,Datos!$H$2:$H$1121,0),0)","v":{"$error":"#N/A"}},null,"",null,"",null,{"$error":"#N/A"}]
[null,{"$f":"OFFSET(Datos!$B$1,MATCH(A56,Datos!$A$2:$A$34,0),0)","v":{"$error":"#N/A"}},null,"",null,{"$f":"OFFSET(Datos!$G$1,MATCH(E56,Datos!$H$2:$H$1121,0),0)","v":{"$error":"#N/A"}},null,"",null,"",null,{"$error":"#N/A"}]
[null,{"$f":"OFFSET(Datos!$B$1,MATCH(A57,Datos!$A$2:$A$34,0),0)","v":{"$error":"#N/A"}},null,"",null,{"$f":"OFFSET(Datos!$G$1,MATCH(E57,Datos!$H$2:$H$1121,0),0)","v":{"$error":"#N/A"}},null,"",null,"",null,{"$error":"#N/A"}]
[null,{"$f":"OFFSET(Datos!$B$1,MATCH(A58,Datos!$A$2:$A$34,0),0)","v":{"$error":"#N/A"}},null,"",null,{"$f":"OFFSET(Datos!$G$1,MATCH(E58,Datos!$H$2:$H$1121,0),0)","v":{"$error":"#N/A"}},null,"",null,"",null,{"$error":"#N/A"}]
[null,{"$f":"OFFSET(Datos!$B$1,MATCH(A59,Datos!$A$2:$A$34,0),0)","v":{"$error":"#N/A"}},null,"",null,{"$f":"OFFSET(Datos!$G$1,MATCH(E59,Datos!$H$2:$H$1121,0),0)","v":{"$error":"#N/A"}},null,"",null,"",null,{"$error":"#N/A"}]
[null,{"$f":"OFFSET(Datos!$B$1,MATCH(A60,Datos!$A$2:$A$34,0),0)","v":{"$error":"#N/A"}},null,"",null,{"$f":"OFFSET(Datos!$G$1,MATCH(E60,Datos!$H$2:$H$1121,0),0)","v":{"$error":"#N/A"}},null,"",null,"",null,{"$error":"#N/A"}]
{"$rows_left_out":941}
{"sheet":"Datos","index":1,"n_rows":1121,"n_cols":16,"rows_kept":1121,"cut":false,"hidden":false,"merged":[[28,9,29,9],[22,13,23,13],[40,13,43,13],[26,13,38,13],[1,13,3,13],[1,9,11,9],[6,13,20,13],[12,9,16,9],[17,9,27,9]]}
["Nombre Departamento","Código Deapartamento",null,"Nombre Departamento","Nombre Municipio",null,"Código Municipio","Nombre Municipio",null,"SERVICIO","SUBSERVICIO","MACRO"]
["ANTIOQUIA","05",null,"ANTIOQUIA","MEDELLIN",null,"001","MEDELLIN",null,"Recoleccion","01 Recoleccion Domiciliaria","01",null,"Turno","1 DIA",1]
["ATLANTICO","08",null,"ANTIOQUIA","ABEJORRAL",null,"002","ABEJORRAL",null,null,"02 Recoleccion Grandes Generadores","02",null,null,"2 TARDE",2]
["BOGOTA","11",null,"ANTIOQUIA","ABRIAQUI",null,"004","ABRIAQUI",null,null,"03 Recoleccion Barrido Manual y Empuje","03",null,null,"3 NOCHE",3]
["BOLIVAR","13",null,"ANTIOQUIA","ALEJANDRIA",null,"021","ALEJANDRIA",null,null,"04 Recoleccion Barrido de Playa","04"]
["BOYACA","15",null,"ANTIOQUIA","AMAGA",null,"030","AMAGA",null,null,"05 Recoleccion Barrido Mecanico","05"]
["CALDAS","17",null,"ANTIOQUIA","AMALFI",null,"031","AMALFI",null,null,"06 Recoleccion Comercial","06",null,"Frecuencia","01 LU-MI-VI","01"]
["CAQUETA","18",null,"ANTIOQUIA","ANDES",null,"034","ANDES",null,null,"07 Recoleccion Vias principales","07",null,null,"02 MA-JU-SA","02"]
["CAUCA","19",null,"ANTIOQUIA","ANGELOPOLIS",null,"036","ANGELOPOLIS",null,null,"08 Recoleccion Rural","08",null,null,"03 LU-JU","03"]
["CESAR","20",null,"ANTIOQUIA","ANGOSTURA",null,"038","ANGOSTURA",null,null,"09 Recoleccion Lateral","09",null,null,"04 MA-VI","04"]
["CORDOBA","23",null,"ANTIOQUIA","ANORI",null,"040","ANORI",null,null,"10 Recoleccion Aprovechamiento","10",null,null,"05 MI-SA","05"]
["CUNDINAMARCA","25",null,"ANTIOQUIA","SANTAFE DE ANTIOQUIA",null,"042","SANTAFE DE ANTIOQUIA",null,null,"11 Recoleccion Sub-Normal","11",null,null,"06 LU-MA-MI-JU-VI-SA","06"]
["CHOCO","27",null,"ANTIOQUIA","ANZA",null,"044","ANZA",null,"Clus","17  Lavado Areas Publicas","17",null,null,"07 LU-MA-MI-JU-VI-SA-DO","07"]
["HUILA","41",null,"ANTIOQUIA","APARTADO",null,"045","APARTADO",null,null,"18 Limpieza de Playas","18",null,null,"08 DO","08"]
["GUAJIRA","44",null,"ANTIOQUIA","ARBOLETES",null,"051","ARBOLETES",null,null,"19 Corte Cesped","19",null,null,"09 LU","09"]
["MAGDALENA","47",null,"ANTIOQUIA","ARGELIA",null,"055","ARGELIA",null,null,"20 Podas Arboles","20",null,null,"10 MA","10"]
["META","50",null,"ANTIOQUIA","ARMENIA",null,"059","ARMENIA",null,null,"21 Mantenimiento Cestas","21",null,null,"11 MI","11"]
["NARIÑO","52",null,"ANTIOQUIA","BARBOSA",null,"079","BARBOSA",null,"Servicios Especiales","22 Limpieza de botaderos","22",null,null,"12 JU","12"]
["NORTEDESANTANDER","54",null,"ANTIOQUIA","BELMIRA",null,"086","BELMIRA",null,null,"23 Limpieza de vias y areas publicas","23",null,null,"13 VI","13"]
["QUINDIO","63",null,"ANTIOQUIA","BELLO",null,"088","BELLO",null,null,"24 Madera","24",null,null,"14 SA","14"]
["RISARALDA","66",null,"ANTIOQUIA","BETANIA",null,"091","BETANIA",null,null,"25 Raspe","25",null,null,"15 Mesual","15"]
["SANTANDER","68",null,"ANTIOQUIA","BETULIA",null,"093","BETULIA",null,null,"26 Eventos Regionales","26"]
["SUCRE","70",null,"ANTIOQUIA","CIUDAD BOLIVAR",null,"101","CIUDAD BOLIVAR",null,null,"27 Limalla","27",null,"Ejecuta","SI"]
["TOLIMA","73",null,"ANTIOQUIA","BRICEÑO",null,"107","BRICEÑO",null,null,"28 Escombros","28",null,null,"NO"]
["VALLEDELCAUCA","76",null,"ANTIOQUIA","BURITICA",null,"113","BURITICA",null,null,"29 Inorganicos","29"]
["ARAUCA","81",null,"ANTIOQUIA","CACERES",null,"120","CACERES",null,null,"30 Carbonilla","30"]
["CASANARE","85",null,"ANTIOQUIA","CAICEDO",null,"125","CAICEDO",null,null,"31 Recoleccion Podas","31",null,"Tipo de Vehiculos","COMPACTADOR 25Y"]
["PUTUMAYO","86",null,"ANTIOQUIA","CALDAS",null,"129","CALDAS",null,null,"32 Voluminosos","32",null,null,"COMPACTADOR 20Y"]
["SAN ANDRES","88",null,"ANTIOQUIA","CAMPAMENTO",null,"134","CAMPAMENTO",null,"Respel","33 Recoleccion Hospitalaria","33",null,null,"COMPACTADOR 16Y"]
["AMAZONAS","91",null,"ANTIOQUIA","CAÑASGORDAS",null,"138","CAÑASGORDAS",null,null,"34 Respel","34",null,null,"COMPACTADOR 10Y"]
["GUAINIA","94",null,"ANTIOQUIA","CARACOLI",null,"142","CARACOLI",null,"Multicontainer","35 Recoleccion Multicontaniner","35",null,null,"COMPACTADOR 16Y"]
["GUAVIARE","95",null,"ANTIOQUIA","CARAMANTA",null,"145","CARAMANTA",null,"Estación de transferencia","36 Estación de transferencia","36",null,null,"COMPACTADOR LATERAL"]
["VAUPES","97",null,"ANTIOQUIA","CAREPA",null,"147","CAREPA",null,"Lavado Contenedores","37 Lateral","37",null,null,"LAVA CONTENEDOR"]
["VICHADA","99",null,"ANTIOQUIA","EL CARMEN DE VIBORAL",null,"148","EL CARMEN DE VIBORAL",null,null,null,null,null,null,"VOLQUETA SENCILLA"]
[null,null,null,"ANTIOQUIA","CAROLINA",null,"150","CAROLINA",null,null,null,null,null,null,"VOLQUETA DOBLETOQUE"]
[null,null,null,"ANTIOQUIA","CAUCASIA",null,"154","CAUCASIA",null,null,null,null,null,null,"AMPLIROLL"]
[null,null,null,"ANTIOQUIA","CHIGORODO",null,"172","CHIGORODO",null,null,null,null,null,null,"MULTICONTAINER"]
[null,null,null,"ANTIOQUIA","CISNEROS",null,"190","CISNEROS",null,null,null,null,null,null,"GRAPPLE"]
[null,null,null,"ANTIOQUIA","COCORNA",null,"197","COCORNA",null,null,null,null,null,null,"FURGON"]
[null,null,null,"ANTIOQUIA","CONCEPCION",null,"206","CONCEPCION"]
[null,null,null,"ANTIOQUIA","CONCORDIA",null,"209","CONCORDIA",null,null,null,null,null,"Tipo de Bolsas","ALTALENE"]
[null,null,null,"ANTIOQUIA","COPACABANA",null,"212","COPACABANA",null,null,null,null,null,null,"DESARENE"]
[null,null,null,"ANTIOQUIA","DABEIBA",null,"234","DABEIBA",null,null,null,null,null,null,"JUMBO"]
[null,null,null,"ANTIOQUIA","DON MATIAS",null,"237","DON MATIAS",null,null,null,null,null,null,"BARREDORA"]
[null,null,null,"ANTIOQUIA","EBEJICO",null,"240","EBEJICO"]
[null,null,null,"ANTIOQUIA","EL BAGRE",null,"250","EL BAGRE"]
[null,null,null,"ANTIOQUIA","ENTRERRIOS",null,"264","ENTRERRIOS"]
[null,null,null,"ANTIOQUIA","ENVIGADO",null,"266","ENVIGADO"]
[null,null,null,"ANTIOQUIA","FREDONIA",null,"282","FREDONIA"]
[null,null,null,"ANTIOQUIA","FRONTINO",null,"284","FRONTINO"]
[null,null,null,"ANTIOQUIA","GIRALDO",null,"306","GIRALDO"]
[null,null,null,"ANTIOQUIA","GIRARDOTA",null,"308","GIRARDOTA"]
[null,null,null,"ANTIOQUIA","GOMEZ PLATA",null,"310","GOMEZ PLATA"]
[null,null,null,"ANTIOQUIA","GRANADA",null,"313","GRANADA"]
[null,null,null,"ANTIOQUIA","GUADALUPE",null,"315","GUADALUPE"]
[null,null,null,"ANTIOQUIA","GUARNE",null,"318","GUARNE"]
[null,null,null,"ANTIOQUIA","GUATAPE",null,"321","GUATAPE"]
[null,null,null,"ANTIOQUIA","HELICONIA",null,"347","HELICONIA"]
[null,null,null,"ANTIOQUIA","HISPANIA",null,"353","HISPANIA"]
[null,null,null,"ANTIOQUIA","ITAGUI",null,"360","ITAGUI"]
{"$rows_left_out":1061}